Search found 3 matches: fatal error ffi.h

Searched query: fatal error ffi h

ignored: h

by pythoncoder
Thu Apr 19, 2018 5:28 am
Forum: General Discussion and Questions
Topic: dir and __getattr__ weirdness
Replies: 15
Views: 3186

Re: dir and __getattr__ weirdness

... 'utf-8', 'AF_INET', 'AF_INET6', 'AF_UNIX', 'ARRAY', 'ArithmeticError', 'AssertionError', 'AttributeError', 'B115200', 'B57600', 'B9600', ... 'expandhome', 'warn_ussl', 'url_open', 'get_pkg_metadata', 'fatal', 'install_pkg', 'install', 'get_install_path', 'cleanup', 'help', ...
by jjlong
Wed Mar 16, 2016 7:24 am
Forum: General Discussion and Questions
Topic: Cross compiling to arm-linux
Replies: 7
Views: 5490

Cross compiling to arm-linux

... with the following message: modffi.c:32:17: fatal error: ffi.h: No such file or directory #include <ffi.h> ^ compilation terminated. ...